Reaction Details
TargetCarbonic anhydrase 5A, mitochondrial
LigandBDBM10881
Substrate/Competitorn/a
Meas. Tech.ChEMBL_475788 (CHEMBL935613)
Ki 65±n/a nM
Citation Di Fiore, APedone, CAntel, JWaldeck, HWitte, AWurl, MScozzafava, ASupuran, CTDe Simone, G Carbonic anhydrase inhibitors: the X-ray crystal structure of ethoxzolamide complexed to human isoform II reveals the importance of thr200 and gln92 for obtaining tight-binding inhibitors. Bioorg Med Chem Lett18:2669-74 (2008) 
 
Carbonic anhydrase 5A, mitochondrial
Name:Carbonic anhydrase 5A, mitochondrial
Type:Enzyme
Mol. Mass.:34755.54
Organism:Homo sapiens (Human)
Description:Human (cloned) isozyme
Residue:305
BDBM10881
NameBDBM10881
Synonyms:CHEMBL288100 Methazolamide Methazolamide, MZA Sulfonamide, 2 sulfonamide 2
TypeSmall organic molecule
Emp. Form.C5H8N4O3S2
Mol. Mass.236.272
SMILESCC(=O)N=c1sc(nn1C)S(N)(=O)=O