Reaction Details
TargetTyrosine-protein kinase ABL1
LigandBDBM13216
Substrate/Competitorn/a
Meas. Tech.ChEMBL_477211 (CHEMBL924604)
IC50 14±n/a nM
Citation Hantschel, ORix, USchmidt, UBürckstümmer, TKneidinger, MSchütze, GColinge, JBennett, KLEllmeier, WValent, PSuperti-Furga, G The Btk tyrosine kinase is a major target of the Bcr-Abl inhibitor dasatinib. Proc Natl Acad Sci U S A104:13283-8 (2007) 
 
Tyrosine-protein kinase ABL1
Name:Tyrosine-protein kinase ABL1
Type:Enzyme
Mol. Mass.:122897.30
Organism:Homo sapiens (Human)
Description:P00519
Residue:1130
BDBM13216
NameBDBM13216
Synonyms:BMS-354825 DASATINIB N-(2-chloro-6-methylphenyl)-2-({6-[4-(2-hydroxyethyl)piperazin-1-yl]-2-methylpyrimidin-4-yl}amino)-1,3-thiazole-5-carboxamide US20230348453, Compound A8 med.21724, Compound Dasatinib
TypeSmall organic molecule
Emp. Form.C22H26ClN7O2S
Mol. Mass.488.006
SMILESCc1nc(Nc2ncc(s2)C(=O)Nc2c(C)cccc2Cl)cc(n1)N1CCN(CCO)CC1