Reaction Details
TargetPhosphotransferase
LigandBDBM50180152
Substrate/Competitorn/a
Meas. Tech.ChEMBL_477692 (CHEMBL931372)
Ki 2800±n/a nM
Citation Sanz-Rodríguez, CEConcepción, JLPekerar, SOldfield, EUrbina, JA Bisphosphonates as inhibitors of Trypanosoma cruzi hexokinase: kinetic and metabolic studies. J Biol Chem282:12377-87 (2007) 
 
Phosphotransferase
Name:Phosphotransferase
Synonyms:Hexokinase
Type:PROTEIN
Mol. Mass.:52180.94
Organism:Trypanosoma cruzi
Description:ChEMBL_330068
Residue:471
BDBM50180152
NameBDBM50180152
TypeSmall organic molecule
Emp. Form.C15H18N2O6P2
Mol. Mass.384.2607
SMILESCCn1c2ccccc2c2cc(NC(P(O)(O)=O)P(O)(O)=O)ccc12