Reaction Details
TargetPhosphotransferase
LigandBDBM50098386
Substrate/Competitorn/a
Meas. Tech.ChEMBL_477694 (CHEMBL931371)
Ki 2800±n/a nM
Citation Sanz-Rodríguez, CEConcepción, JLPekerar, SOldfield, EUrbina, JA Bisphosphonates as inhibitors of Trypanosoma cruzi hexokinase: kinetic and metabolic studies. J Biol Chem282:12377-87 (2007) 
 
Phosphotransferase
Name:Phosphotransferase
Synonyms:Hexokinase
Type:PROTEIN
Mol. Mass.:52180.94
Organism:Trypanosoma cruzi
Description:ChEMBL_330068
Residue:471
BDBM50098386
NameBDBM50098386
TypeSmall organic molecule
Emp. Form.C7H11NO7P2
Mol. Mass.283.1123
SMILESOC(Cc1ccncc1)(P(O)(O)=O)P(O)(O)=O