Reaction Details
TargetPhosphotransferase
LigandBDBM50138040
Substrate/Competitorn/a
Meas. Tech.ChEMBL_477724 (CHEMBL927022)
IC50 810±n/a nM
Citation Sanz-Rodríguez, CEConcepción, JLPekerar, SOldfield, EUrbina, JA Bisphosphonates as inhibitors of Trypanosoma cruzi hexokinase: kinetic and metabolic studies. J Biol Chem282:12377-87 (2007) 
 
Phosphotransferase
Name:Phosphotransferase
Synonyms:Hexokinase
Type:PROTEIN
Mol. Mass.:52180.94
Organism:Trypanosoma cruzi
Description:ChEMBL_330068
Residue:471
BDBM50138040
NameBDBM50138040
TypeSmall organic molecule
Emp. Form.C13H15NO6P2
Mol. Mass.343.2088
SMILESOP(O)(=O)C(Nc1cccc(c1)-c1ccccc1)P(O)(O)=O