Reaction Details
TargetPhosphotransferase
LigandBDBM50173768
Substrate/Competitorn/a
Meas. Tech.ChEMBL_477724 (CHEMBL927022)
IC50 810±n/a nM
Citation Sanz-Rodríguez, CEConcepción, JLPekerar, SOldfield, EUrbina, JA Bisphosphonates as inhibitors of Trypanosoma cruzi hexokinase: kinetic and metabolic studies. J Biol Chem282:12377-87 (2007) 
 
Phosphotransferase
Name:Phosphotransferase
Synonyms:Hexokinase
Type:PROTEIN
Mol. Mass.:52180.94
Organism:Trypanosoma cruzi
Description:ChEMBL_330068
Residue:471
BDBM50173768
NameBDBM50173768
TypeSmall organic molecule
Emp. Form.C13H14O7P2
Mol. Mass.344.1936
SMILESOC(c1cccc(c1)-c1ccccc1)(P(O)(O)=O)P(O)(O)=O