Reaction Details
TargetPhosphotransferase
LigandBDBM25269
Substrate/Competitorn/a
Meas. Tech.ChEMBL_477724 (CHEMBL927022)
IC50 810±n/a nM
Citation Sanz-Rodríguez, CEConcepción, JLPekerar, SOldfield, EUrbina, JA Bisphosphonates as inhibitors of Trypanosoma cruzi hexokinase: kinetic and metabolic studies. J Biol Chem282:12377-87 (2007) 
 
Phosphotransferase
Name:Phosphotransferase
Synonyms:Hexokinase
Type:PROTEIN
Mol. Mass.:52180.94
Organism:Trypanosoma cruzi
Description:ChEMBL_330068
Residue:471
BDBM25269
NameBDBM25269
TypeSmall organic molecule
Emp. Form.C10H24O7P2
Mol. Mass.318.2409
SMILESCCCCCCCCCC(O)(P(O)(O)=O)P(O)(O)=O