Reaction Details
TargetPhosphotransferase
LigandBDBM50173752
Substrate/Competitorn/a
Meas. Tech.ChEMBL_477724 (CHEMBL927022)
IC50 810±n/a nM
Citation Sanz-Rodríguez, CEConcepción, JLPekerar, SOldfield, EUrbina, JA Bisphosphonates as inhibitors of Trypanosoma cruzi hexokinase: kinetic and metabolic studies. J Biol Chem282:12377-87 (2007) 
 
Phosphotransferase
Name:Phosphotransferase
Synonyms:Hexokinase
Type:PROTEIN
Mol. Mass.:52180.94
Organism:Trypanosoma cruzi
Description:ChEMBL_330068
Residue:471
BDBM50173752
NameBDBM50173752
TypeSmall organic molecule
Emp. Form.C9H15NO7P2
Mol. Mass.311.1654
SMILESCOCc1cccc(NC(P(O)(O)=O)P(O)(O)=O)c1