Reaction Details
TargetTelomerase reverse transcriptase
LigandBDBM50134030
Substrate/Competitorn/a
Meas. Tech.ChEMBL_477735 (CHEMBL926069)
IC50 65±n/a nM
Citation De Cian, ACristofari, GReichenbach, PDe Lemos, EMonchaud, DTeulade-Fichou, MPShin-Ya, KLacroix, LLingner, JMergny, JL Reevaluation of telomerase inhibition by quadruplex ligands and their mechanisms of action. Proc Natl Acad Sci U S A104:17347-52 (2007) 
 
Telomerase reverse transcriptase
Name:Telomerase reverse transcriptase
Type:PROTEIN
Mol. Mass.:127099.03
Organism:Homo sapiens (Human)
Description:ChEMBL_1447029
Residue:1132
BDBM50134030
NameBDBM50134030
Synonyms:9-[4-(N,N-dimethylamino)phenylamino]-3,6-bis(3-pyrrolodinopropionamido) acridine N,N'-(9-{[4-(dimethylamino)phenyl]amino}acridine-3,6-diyl)bis(3-pyrrolidin-1-ylpropanamide)
TypeSmall organic molecule
Emp. Form.C35H43N7O2
Mol. Mass.593.7616
SMILESCN(C)c1ccc(Nc2c3ccc(NC(=O)CCN4CCCC4)cc3nc3cc(NC(=O)CCN4CCCC4)ccc23)cc1