Reaction Details
TargetTelomerase reverse transcriptase
LigandBDBM50339190
Substrate/Competitorn/a
Meas. Tech.ChEMBL_477738 (CHEMBL926072)
IC50 58±n/a nM
Citation De Cian, ACristofari, GReichenbach, PDe Lemos, EMonchaud, DTeulade-Fichou, MPShin-Ya, KLacroix, LLingner, JMergny, JL Reevaluation of telomerase inhibition by quadruplex ligands and their mechanisms of action. Proc Natl Acad Sci U S A104:17347-52 (2007) 
 
Telomerase reverse transcriptase
Name:Telomerase reverse transcriptase
Type:PROTEIN
Mol. Mass.:127099.03
Organism:Homo sapiens (Human)
Description:ChEMBL_1447029
Residue:1132
BDBM50339190
NameBDBM50339190
Synonyms:CHEMBL443683 | telomestatin
TypeSmall organic molecule
Emp. Form.C26H14N8O7S
Mol. Mass.582.504
SMILESCc1oc2nc1c1nc(co1)c1nc(co1)c1nc(co1)c1nc(co1)c1nc(co1)c1SCc(n1)c1[nH]c2c(C)o1