Reaction Details
TargetTelomerase reverse transcriptase
LigandBDBM50376748
Substrate/Competitorn/a
Meas. Tech.ChEMBL_477734 (CHEMBL926068)
IC50 1.5±n/a nM
Citation De Cian, ACristofari, GReichenbach, PDe Lemos, EMonchaud, DTeulade-Fichou, MPShin-Ya, KLacroix, LLingner, JMergny, JL Reevaluation of telomerase inhibition by quadruplex ligands and their mechanisms of action. Proc Natl Acad Sci U S A104:17347-52 (2007) 
 
Telomerase reverse transcriptase
Name:Telomerase reverse transcriptase
Type:PROTEIN
Mol. Mass.:127099.03
Organism:Homo sapiens (Human)
Description:ChEMBL_1447029
Residue:1132
BDBM50376748
NameBDBM50376748
Synonyms:CHEMBL259739 | Phen-DC3
TypeSmall organic molecule
Emp. Form.C34H26N6O2
Mol. Mass.550.6081
SMILESC[n+]1cc(NC(=O)c2ccc3ccc4ccc(nc4c3n2)C(=O)Nc2c[n+](C)c3ccccc3c2)cc2ccccc12