Reaction Details
TargetC5a anaphylatoxin chemotactic receptor 1
LigandBDBM50376812
Substrate/Competitorn/a
Meas. Tech.ChEMBL_477916 (CHEMBL923541)
IC50 530±n/a nM
Citation Barbay, JKGong, YBuntinx, MLi, JClaes, CHornby, PJVan Lommen, GVan Wauwe, JHe, W Synthesis and characterization of 5,6,7,8-tetrahydroquinoline C5a receptor antagonists. Bioorg Med Chem Lett18:2544-8 (2008) 
 
C5a anaphylatoxin chemotactic receptor 1
Name:C5a anaphylatoxin chemotactic receptor 1
Type:Enzyme
Mol. Mass.:39347.68
Organism:Homo sapiens (Human)
Description:P21730
Residue:350
BDBM50376812
NameBDBM50376812
Synonyms:CHEMBL261277
TypeSmall organic molecule
Emp. Form.C32H36N2O2
Mol. Mass.480.6404
SMILESCCc1cccc(CC)c1-c1cc(OC)c2C(CCCc2n1)N(C)c1ccc(OC)c2ccccc12