Reaction Details
TargetC5a anaphylatoxin chemotactic receptor 1
LigandBDBM50376814
Substrate/Competitorn/a
Meas. Tech.ChEMBL_477916 (CHEMBL923541)
IC50 6200±n/a nM
Citation Barbay, JKGong, YBuntinx, MLi, JClaes, CHornby, PJVan Lommen, GVan Wauwe, JHe, W Synthesis and characterization of 5,6,7,8-tetrahydroquinoline C5a receptor antagonists. Bioorg Med Chem Lett18:2544-8 (2008) 
 
C5a anaphylatoxin chemotactic receptor 1
Name:C5a anaphylatoxin chemotactic receptor 1
Type:Enzyme
Mol. Mass.:39347.68
Organism:Homo sapiens (Human)
Description:P21730
Residue:350
BDBM50376814
NameBDBM50376814
Synonyms:CHEMBL260472
TypeSmall organic molecule
Emp. Form.C32H34N2O2
Mol. Mass.478.6246
SMILESCCc1cccc(CC)c1-c1cc(OC)c2C(CCCc2n1)N(C(C)=O)c1cccc2ccccc12