Reaction Details
TargetC5a anaphylatoxin chemotactic receptor 1
LigandBDBM50376793
Substrate/Competitorn/a
Meas. Tech.ChEMBL_477916 (CHEMBL923541)
IC50 100.0±n/a nM
Citation Barbay, JKGong, YBuntinx, MLi, JClaes, CHornby, PJVan Lommen, GVan Wauwe, JHe, W Synthesis and characterization of 5,6,7,8-tetrahydroquinoline C5a receptor antagonists. Bioorg Med Chem Lett18:2544-8 (2008) 
 
C5a anaphylatoxin chemotactic receptor 1
Name:C5a anaphylatoxin chemotactic receptor 1
Type:Enzyme
Mol. Mass.:39347.68
Organism:Homo sapiens (Human)
Description:P21730
Residue:350
BDBM50376793
NameBDBM50376793
Synonyms:CHEMBL259769
TypeSmall organic molecule
Emp. Form.C32H36N2O
Mol. Mass.464.641
SMILESCCN(C1CCCc2nc(cc(OC)c12)-c1c(CC)cccc1CC)c1cccc2ccccc12