Reaction Details
TargetC5a anaphylatoxin chemotactic receptor 1
LigandBDBM50376817
Substrate/Competitorn/a
Meas. Tech.ChEMBL_477917 (CHEMBL923542)
Ki 86±n/a nM
Citation Barbay, JKGong, YBuntinx, MLi, JClaes, CHornby, PJVan Lommen, GVan Wauwe, JHe, W Synthesis and characterization of 5,6,7,8-tetrahydroquinoline C5a receptor antagonists. Bioorg Med Chem Lett18:2544-8 (2008) 
 
C5a anaphylatoxin chemotactic receptor 1
Name:C5a anaphylatoxin chemotactic receptor 1
Type:Enzyme
Mol. Mass.:39347.68
Organism:Homo sapiens (Human)
Description:P21730
Residue:350
BDBM50376817
NameBDBM50376817
Synonyms:CHEMBL259643
TypeSmall organic molecule
Emp. Form.C30H32N2O
Mol. Mass.436.5879
SMILESCCN(C1CCCc2nc(cc(OC)c12)-c1ccccc1CC)c1cccc2ccccc12