Reaction Details
TargetHistamine H1 receptor
LigandBDBM50095890
Substrate/Competitorn/a
Meas. Tech.ChEMBL_478587 (CHEMBL940856)
IC50 40±n/a nM
Citation Kim, SFHuang, ASSnowman, AMTeuscher, CSnyder, SH From the Cover: Antipsychotic drug-induced weight gain mediated by histamine H1 receptor-linked activation of hypothalamic AMP-kinase. Proc Natl Acad Sci U S A104:3456-9 (2007) 
 
Histamine H1 receptor
Name:Histamine H1 receptor
Type:Enzyme Catalytic Domain
Mol. Mass.:55716.35
Organism:RAT
Description:HISTAMINE H1 HRH1 RAT::P31390
Residue:486
BDBM50095890
NameBDBM50095890
Synonyms:2-[2-(4-Dibenzo[b,f][1,4]thiazepin-11-yl-1-piperazinyl)ethoxy]ethanol CHEMBL716 | QUETIAPINE
TypeSmall organic molecule
Emp. Form.C21H25N3O2S
Mol. Mass.383.507
SMILESOCCOCCN1CCN(CC1)C1=Nc2ccccc2Sc2ccccc12