Reaction Details
TargetAdenosine receptor A2b
LigandBDBM50205589
Substrate/Competitorn/a
Meas. Tech.ChEMBL_478884 (CHEMBL937355)
EC50 60953690±n/a nM
Citation Ivanov, AAWang, BKlutz, AMChen, VLGao, ZGJacobson, KA Probing distal regions of the A2B adenosine receptor by quantitative structure-activity relationship modeling of known and novel agonists. J Med Chem51:2088-99 (2008) 
 
Adenosine receptor A2b
Name:Adenosine receptor A2b
Type:G Protein-Coupled Receptor (GPCR)
Mol. Mass.:36341.22
Organism:Homo sapiens (Human)
Description:n/a
Residue:332
BDBM50205589
NameBDBM50205589
Synonyms:(2S,3S,4R,5R)-5-(6-(4-(2-(4-tert-butylphenylamino)-2-oxoethoxy)phenylamino)-9H-purin-9-yl)-N-ethyl-3,4-dihydroxy-tetrahydrofuran-2-carboxamide CHEMBL388405
TypeSmall organic molecule
Emp. Form.C30H35N7O6
Mol. Mass.589.6422
SMILESCCNC(=O)[C@H]1O[C@H]([C@H](O)[C@@H]1O)n1cnc2c(Nc3ccc(OCC(=O)Nc4ccc(cc4)C(C)(C)C)cc3)ncnc12