Reaction Details
TargetKappa-type opioid receptor
LigandBDBM50377011
Substrate/Competitorn/a
Meas. Tech.ChEMBL_479227 (CHEMBL927001)
EC50 0.110000±n/a nM
Citation Kumar, VGuo, DMarella, MCassel, JADehaven, RNDaubert, JDMansson, E Use of receptor chimeras to identify small molecules with high affinity for the dynorphin A binding domain of the kappa opioid receptor. Bioorg Med Chem Lett18:3667-71 (2008) 
 
Kappa-type opioid receptor
Name:Kappa-type opioid receptor
Type:G Protein-Coupled Receptor (GPCR)
Mol. Mass.:42648.76
Organism:Homo sapiens (Human)
Description:P41145
Residue:380
BDBM50377011
NameBDBM50377011
Synonyms:CHEMBL257139
TypeSmall organic molecule
Emp. Form.C24H31N3O6S
Mol. Mass.489.584
SMILESCN(C)S(=O)(=O)c1cc2OCOc2cc1CC(=O)N(C)[C@H](CN1CC[C@H](O)C1)c1ccccc1