Reaction Details
TargetDelta-type opioid receptor
LigandBDBM50377007
Substrate/Competitorn/a
Meas. Tech.ChEMBL_479226 (CHEMBL927002)
Ki 0.850000±n/a nM
Citation Kumar, VGuo, DMarella, MCassel, JADehaven, RNDaubert, JDMansson, E Use of receptor chimeras to identify small molecules with high affinity for the dynorphin A binding domain of the kappa opioid receptor. Bioorg Med Chem Lett18:3667-71 (2008) 
 
Delta-type opioid receptor
Name:Delta-type opioid receptor
Type:G Protein-Coupled Receptor (GPCR)
Mol. Mass.:40382.98
Organism:Homo sapiens (Human)
Description:Competition binding assays were carried out using membrane preparations from transfected HN9.10 cells that constitutively expressed the delta opioid receptor.
Residue:372
BDBM50377007
NameBDBM50377007
Synonyms:CHEMBL257355
TypeSmall organic molecule
Emp. Form.C27H37N3O6S
Mol. Mass.531.664
SMILESCOc1cc(CC(=O)N(C)[C@H](CN2CC[C@H](O)C2)c2ccccc2)c(cc1OC)S(=O)(=O)N1CCCC1