Reaction Details
TargetMu-type opioid receptor
LigandBDBM50377005
Substrate/Competitorn/a
Meas. Tech.ChEMBL_479225 (CHEMBL927003)
Ki 47±n/a nM
Citation Kumar, VGuo, DMarella, MCassel, JADehaven, RNDaubert, JDMansson, E Use of receptor chimeras to identify small molecules with high affinity for the dynorphin A binding domain of the kappa opioid receptor. Bioorg Med Chem Lett18:3667-71 (2008) 
 
Mu-type opioid receptor
Name:Mu-type opioid receptor
Type:G Protein-Coupled Receptor (GPCR)
Mol. Mass.:44789.51
Organism:Homo sapiens (Human)
Description:P35372
Residue:400
BDBM50377005
NameBDBM50377005
Synonyms:CHEMBL402135
TypeSmall organic molecule
Emp. Form.C24H31N3O5S
Mol. Mass.473.585
SMILESCN(C)S(=O)(=O)c1cc2OCOc2cc1CC(=O)N(C)[C@H](CN1CCCC1)c1ccccc1