Reaction Details
TargetMu-type opioid receptor
LigandBDBM50377008
Substrate/Competitorn/a
Meas. Tech.ChEMBL_479225 (CHEMBL927003)
Ki 42±n/a nM
Citation Kumar, VGuo, DMarella, MCassel, JADehaven, RNDaubert, JDMansson, E Use of receptor chimeras to identify small molecules with high affinity for the dynorphin A binding domain of the kappa opioid receptor. Bioorg Med Chem Lett18:3667-71 (2008) 
 
Mu-type opioid receptor
Name:Mu-type opioid receptor
Type:G Protein-Coupled Receptor (GPCR)
Mol. Mass.:44789.51
Organism:Homo sapiens (Human)
Description:P35372
Residue:400
BDBM50377008
NameBDBM50377008
Synonyms:CHEMBL254959
TypeSmall organic molecule
Emp. Form.C25H35N3O5S
Mol. Mass.489.628
SMILESCOc1cc(CC(=O)N(C)[C@H](CN2CCCC2)c2ccccc2)c(cc1OC)S(=O)(=O)N(C)C