Reaction Details
TargetKappa-type opioid receptor
LigandBDBM50377009
Substrate/Competitorn/a
Meas. Tech.ChEMBL_479224 (CHEMBL927004)
Ki 0.190000±n/a nM
Citation Kumar, VGuo, DMarella, MCassel, JADehaven, RNDaubert, JDMansson, E Use of receptor chimeras to identify small molecules with high affinity for the dynorphin A binding domain of the kappa opioid receptor. Bioorg Med Chem Lett18:3667-71 (2008) 
 
Kappa-type opioid receptor
Name:Kappa-type opioid receptor
Type:G Protein-Coupled Receptor (GPCR)
Mol. Mass.:42648.76
Organism:Homo sapiens (Human)
Description:P41145
Residue:380
BDBM50377009
NameBDBM50377009
Synonyms:CHEMBL257140
TypeSmall organic molecule
Emp. Form.C30H35N3O5S
Mol. Mass.549.681
SMILESCN(Cc1ccccc1)S(=O)(=O)c1cc2OCOc2cc1CC(=O)N(C)[C@H](CN1CCCC1)c1ccccc1