Reaction Details
TargetMu-type opioid receptor
LigandBDBM50377014
Substrate/Competitorn/a
Meas. Tech.ChEMBL_479225 (CHEMBL927003)
Ki 27±n/a nM
Citation Kumar, VGuo, DMarella, MCassel, JADehaven, RNDaubert, JDMansson, E Use of receptor chimeras to identify small molecules with high affinity for the dynorphin A binding domain of the kappa opioid receptor. Bioorg Med Chem Lett18:3667-71 (2008) 
 
Mu-type opioid receptor
Name:Mu-type opioid receptor
Type:G Protein-Coupled Receptor (GPCR)
Mol. Mass.:44789.51
Organism:Homo sapiens (Human)
Description:P35372
Residue:400
BDBM50377014
NameBDBM50377014
Synonyms:CHEMBL254754
TypeSmall organic molecule
Emp. Form.C28H40N4O6S
Mol. Mass.560.705
SMILESCOc1cc(CC(=O)N(C)[C@H](CN2CC[C@H](O)C2)c2ccccc2)c(cc1OC)S(=O)(=O)N1CCN(C)CC1