Reaction Details
TargetCarbonic anhydrase 15
LigandBDBM32188
Substrate/Competitorn/a
Meas. Tech.ChEMBL_479319 (CHEMBL933691)
Ki 2330±n/a nM
Citation Innocenti, AHilvo, MScozzafava, AParkkila, SSupuran, CT Carbonic anhydrase inhibitors: Inhibition of the new membrane-associated isoform XV with phenols. Bioorg Med Chem Lett18:3593-6 (2008) 
 
Carbonic anhydrase 15
Name:Carbonic anhydrase 15
Type:PROTEIN
Mol. Mass.:35484.02
Organism:Mus musculus
Description:ChEMBL_651955
Residue:324
BDBM32188
NameBDBM32188
Synonyms:CLIOQUINOL TG2-36-2 | cid_2788
TypeSmall organic molecule
Emp. Form.C9H5ClINO
Mol. Mass.305.5
SMILESOc1c(I)cc(Cl)c2cccnc12