Reaction Details
TargetCarboxylic ester hydrolase
LigandBDBM50377437
Substrate/Competitorn/a
Meas. Tech.ChEMBL_479695 (CHEMBL933559)
IC50 27±n/a nM
Citation Fang, LKraus, BLehmann, JHeilmann, JZhang, YDecker, M Design and synthesis of tacrine-ferulic acid hybrids as multi-potent anti-Alzheimer drug candidates. Bioorg Med Chem Lett18:2905-9 (2008) 
 
Carboxylic ester hydrolase
Name:Carboxylic ester hydrolase
Type:Protein
Mol. Mass.:68842.83
Organism:Equus caballus (Horse)
Description:Q9N1N9
Residue:602
BDBM50377437
NameBDBM50377437
Synonyms:CHEMBL255502
TypeSmall organic molecule
Emp. Form.C26H29N3O3
Mol. Mass.431.5268
SMILESCOc1cc(\C=C\C(=O)NCCCNc2c3CCCCc3nc3ccccc23)ccc1O