Reaction Details
TargetAdenosine receptor A2a
LigandBDBM50377476
Substrate/Competitorn/a
Meas. Tech.ChEMBL_479703 (CHEMBL933567)
Ki 3.3±n/a nM
Citation Gillespie, RJCliffe, IADawson, CEDourish, CTGaur, SGiles, PRJordan, AMKnight, ARLawrence, ALerpiniere, JMisra, APratt, RMTodd, RSUpton, RWeiss, SMWilliamson, DS Antagonists of the human adenosine A2A receptor. Part 2: Design and synthesis of 4-arylthieno[3,2-d]pyrimidine derivatives. Bioorg Med Chem Lett18:2920-3 (2008) 
 
Adenosine receptor A2a
Name:Adenosine receptor A2a
Type:G Protein-Coupled Receptor (GPCR)
Mol. Mass.:44716.46
Organism:Homo sapiens (Human)
Description:P29274
Residue:412
BDBM50377476
NameBDBM50377476
Synonyms:CHEMBL260719
TypeSmall organic molecule
Emp. Form.C12H9N3S2
Mol. Mass.259.35
SMILESC1CC1c1nc(-c2nccs2)c2sccc2n1