Reaction Details
TargetAdenosine receptor A1
LigandBDBM50377502
Substrate/Competitorn/a
Meas. Tech.ChEMBL_479704 (CHEMBL933568)
Ki 303±n/a nM
Citation Gillespie, RJCliffe, IADawson, CEDourish, CTGaur, SGiles, PRJordan, AMKnight, ARLawrence, ALerpiniere, JMisra, APratt, RMTodd, RSUpton, RWeiss, SMWilliamson, DS Antagonists of the human adenosine A2A receptor. Part 2: Design and synthesis of 4-arylthieno[3,2-d]pyrimidine derivatives. Bioorg Med Chem Lett18:2920-3 (2008) 
 
Adenosine receptor A1
Name:Adenosine receptor A1
Type:G Protein-Coupled Receptor (GPCR)
Mol. Mass.:36520.92
Organism:Homo sapiens (Human)
Description:P30542
Residue:326
BDBM50377502
NameBDBM50377502
Synonyms:CHEMBL406315
TypeSmall organic molecule
Emp. Form.C12H12N4S2
Mol. Mass.276.38
SMILESCN(C)c1nc(-c2nc(C)cs2)c2sccc2n1