Reaction Details
TargetAdenosine receptor A2a
LigandBDBM50377512
Substrate/Competitorn/a
Meas. Tech.ChEMBL_479713 (CHEMBL921473)
Ki 5±n/a nM
Citation Gillespie, RJCliffe, IADawson, CEDourish, CTGaur, SJordan, AMKnight, ARLerpiniere, JMisra, APratt, RMRoffey, JStratton, GCUpton, RWeiss, SMWilliamson, DS Antagonists of the human adenosine A2A receptor. Part 3: Design and synthesis of pyrazolo[3,4-d]pyrimidines, pyrrolo[2,3-d]pyrimidines and 6-arylpurines. Bioorg Med Chem Lett18:2924-9 (2008) 
 
Adenosine receptor A2a
Name:Adenosine receptor A2a
Type:G Protein-Coupled Receptor (GPCR)
Mol. Mass.:44716.46
Organism:Homo sapiens (Human)
Description:P29274
Residue:412
BDBM50377512
NameBDBM50377512
Synonyms:CHEMBL260209
TypeSmall organic molecule
Emp. Form.C16H12FN5O
Mol. Mass.309.2978
SMILESNc1nc(-c2ccco2)c2ncn(Cc3ccccc3F)c2n1