Reaction Details
TargetAdenosine receptor A1
LigandBDBM50377559
Substrate/Competitorn/a
Meas. Tech.ChEMBL_479714 (CHEMBL921474)
Ki 170±n/a nM
Citation Gillespie, RJCliffe, IADawson, CEDourish, CTGaur, SJordan, AMKnight, ARLerpiniere, JMisra, APratt, RMRoffey, JStratton, GCUpton, RWeiss, SMWilliamson, DS Antagonists of the human adenosine A2A receptor. Part 3: Design and synthesis of pyrazolo[3,4-d]pyrimidines, pyrrolo[2,3-d]pyrimidines and 6-arylpurines. Bioorg Med Chem Lett18:2924-9 (2008) 
 
Adenosine receptor A1
Name:Adenosine receptor A1
Type:G Protein-Coupled Receptor (GPCR)
Mol. Mass.:36520.92
Organism:Homo sapiens (Human)
Description:P30542
Residue:326
BDBM50377559
NameBDBM50377559
Synonyms:CHEMBL259832
TypeSmall organic molecule
Emp. Form.C15H12N6O3
Mol. Mass.324.2942
SMILESNc1nc(-c2ccco2)c2ncn(C(=O)NCc3ccco3)c2n1