Reaction Details
TargetProcathepsin L
LigandBDBM50377589
Substrate/Competitorn/a
Meas. Tech.ChEMBL_479740 (CHEMBL929237)
IC50 118±n/a nM
Citation Mallari, JPShelat, AKosinski, ACaffrey, CRConnelly, MZhu, FMcKerrow, JHGuy, RK Discovery of trypanocidal thiosemicarbazone inhibitors of rhodesain and TbcatB. Bioorg Med Chem Lett18:2883-5 (2008) 
 
Procathepsin L
Name:Procathepsin L
Type:Enzyme
Mol. Mass.:37557.19
Organism:Homo sapiens (Human)
Description:Purchased from Calbiochem (San Diego, CA).
Residue:333
BDBM50377589
NameBDBM50377589
Synonyms:CHEMBL261218
TypeSmall organic molecule
Emp. Form.C16H16FN3S
Mol. Mass.301.382
SMILESNC(=S)NN=C(CCc1ccccc1)c1cccc(F)c1