Reaction Details
TargetProcathepsin L
LigandBDBM50377590
Substrate/Competitorn/a
Meas. Tech.ChEMBL_479740 (CHEMBL929237)
IC50 21±n/a nM
Citation Mallari, JPShelat, AKosinski, ACaffrey, CRConnelly, MZhu, FMcKerrow, JHGuy, RK Discovery of trypanocidal thiosemicarbazone inhibitors of rhodesain and TbcatB. Bioorg Med Chem Lett18:2883-5 (2008) 
 
Procathepsin L
Name:Procathepsin L
Type:Enzyme
Mol. Mass.:37557.19
Organism:Homo sapiens (Human)
Description:Purchased from Calbiochem (San Diego, CA).
Residue:333
BDBM50377590
NameBDBM50377590
Synonyms:CHEMBL258588
TypeSmall organic molecule
Emp. Form.C16H16ClN3S
Mol. Mass.317.836
SMILESNC(=S)NN=C(CCc1ccccc1)c1cccc(Cl)c1