Reaction Details
TargetProcathepsin L
LigandBDBM50377595
Substrate/Competitorn/a
Meas. Tech.ChEMBL_479740 (CHEMBL929237)
IC50 81±n/a nM
Citation Mallari, JPShelat, AKosinski, ACaffrey, CRConnelly, MZhu, FMcKerrow, JHGuy, RK Discovery of trypanocidal thiosemicarbazone inhibitors of rhodesain and TbcatB. Bioorg Med Chem Lett18:2883-5 (2008) 
 
Procathepsin L
Name:Procathepsin L
Type:Enzyme
Mol. Mass.:37557.19
Organism:Homo sapiens (Human)
Description:Purchased from Calbiochem (San Diego, CA).
Residue:333
BDBM50377595
NameBDBM50377595
Synonyms:CHEMBL404938
TypeSmall organic molecule
Emp. Form.C17H14F3N3S
Mol. Mass.349.373
SMILESNC(=S)NN=C(C=Cc1ccccc1)c1cccc(c1)C(F)(F)F