Reaction Details
TargetVascular endothelial growth factor receptor 2
LigandBDBM50377602
Substrate/Competitorn/a
Meas. Tech.ChEMBL_479743 (CHEMBL929240)
IC50 26±n/a nM
Citation Honda, TTajima, HKaneko, YBan, MInaba, TTakeno, YOkamoto, KAono, H Conformation-activity relationship on novel 4-pyridylmethylthio derivatives with antiangiogenic activity. Bioorg Med Chem Lett18:2939-43 (2008) 
 
Vascular endothelial growth factor receptor 2
Name:Vascular endothelial growth factor receptor 2
Type:Receptor Tyrosine Kinase
Mol. Mass.:151510.97
Organism:Homo sapiens (Human)
Description:P35968
Residue:1356
BDBM50377602
NameBDBM50377602
Synonyms:CHEMBL256556
TypeSmall organic molecule
Emp. Form.C18H14ClN3OS
Mol. Mass.355.841
SMILESClc1ccc(NC(=O)c2cccnc2SCc2ccncc2)cc1