Reaction Details
TargetDiacylglycerol lipase-alpha
LigandBDBM50377664
Substrate/Competitorn/a
Meas. Tech.ChEMBL_479895 (CHEMBL935748)
IC50>10000±n/a nM
Citation Ortar, GSchiano Moriello, ACascio, MGDe Petrocellis, LLigresti, AMorera, ENalli, MDi Marzo, V New tetrazole-based selective anandamide uptake inhibitors. Bioorg Med Chem Lett18:2820-4 (2008) 
 
Diacylglycerol lipase-alpha
Name:Diacylglycerol lipase-alpha
Type:PROTEIN
Mol. Mass.:114947.74
Organism:Homo sapiens (Human)
Description:ChEMBL_1449471
Residue:1042
BDBM50377664
NameBDBM50377664
Synonyms:CHEMBL402283
TypeSmall organic molecule
Emp. Form.C17H14N6O
Mol. Mass.318.3327
SMILESO=C(NCc1nnn(CC#N)n1)c1ccc(cc1)-c1ccccc1