Reaction Details
TargetDiacylglycerol lipase-alpha
LigandBDBM50377658
Substrate/Competitorn/a
Meas. Tech.ChEMBL_479895 (CHEMBL935748)
IC50>10000±n/a nM
Citation Ortar, GSchiano Moriello, ACascio, MGDe Petrocellis, LLigresti, AMorera, ENalli, MDi Marzo, V New tetrazole-based selective anandamide uptake inhibitors. Bioorg Med Chem Lett18:2820-4 (2008) 
 
Diacylglycerol lipase-alpha
Name:Diacylglycerol lipase-alpha
Type:PROTEIN
Mol. Mass.:114947.74
Organism:Homo sapiens (Human)
Description:ChEMBL_1449471
Residue:1042
BDBM50377658
NameBDBM50377658
Synonyms:CHEMBL257157
TypeSmall organic molecule
Emp. Form.C16H13N5
Mol. Mass.275.3079
SMILESN#CCn1nnc(Cc2ccc(cc2)-c2ccccc2)n1