Reaction Details
TargetCannabinoid receptor 1
LigandBDBM50377666
Substrate/Competitorn/a
Meas. Tech.ChEMBL_479896 (CHEMBL935749)
Ki>10000±n/a nM
Citation Ortar, GSchiano Moriello, ACascio, MGDe Petrocellis, LLigresti, AMorera, ENalli, MDi Marzo, V New tetrazole-based selective anandamide uptake inhibitors. Bioorg Med Chem Lett18:2820-4 (2008) 
 
Cannabinoid receptor 1
Name:Cannabinoid receptor 1
Type:G Protein-Coupled Receptor (GPCR)
Mol. Mass.:52868.96
Organism:Homo sapiens (Human)
Description:P21554
Residue:472
BDBM50377666
NameBDBM50377666
Synonyms:CHEMBL257570
TypeSmall organic molecule
Emp. Form.C19H21N5O
Mol. Mass.335.4029
SMILESCC(C)Cn1nnnc1CNC(=O)c1ccc(cc1)-c1ccccc1