Reaction Details
TargetFatty-acid amide hydrolase 1 [30-579]
LigandBDBM50377666
Substrate/Competitorn/a
Meas. Tech.ChEMBL_479892 (CHEMBL935745)
IC50>50000±n/a nM
Citation Ortar, GSchiano Moriello, ACascio, MGDe Petrocellis, LLigresti, AMorera, ENalli, MDi Marzo, V New tetrazole-based selective anandamide uptake inhibitors. Bioorg Med Chem Lett18:2820-4 (2008) 
 
Fatty-acid amide hydrolase 1 [30-579]
Name:Fatty-acid amide hydrolase 1 [30-579]
Type:Single-pass membrane protein; homodimer
Mol. Mass.:60474.00
Organism:Rattus norvegicus (rat)
Description:P97612 (aa 30-579)
Residue:550
BDBM50377666
NameBDBM50377666
Synonyms:CHEMBL257570
TypeSmall organic molecule
Emp. Form.C19H21N5O
Mol. Mass.335.4029
SMILESCC(C)Cn1nnnc1CNC(=O)c1ccc(cc1)-c1ccccc1