Reaction Details
TargetFatty-acid amide hydrolase 1 [30-579]
LigandBDBM50377670
Substrate/Competitorn/a
Meas. Tech.ChEMBL_479892 (CHEMBL935745)
IC50>50000±n/a nM
Citation Ortar, GSchiano Moriello, ACascio, MGDe Petrocellis, LLigresti, AMorera, ENalli, MDi Marzo, V New tetrazole-based selective anandamide uptake inhibitors. Bioorg Med Chem Lett18:2820-4 (2008) 
 
Fatty-acid amide hydrolase 1 [30-579]
Name:Fatty-acid amide hydrolase 1 [30-579]
Type:Single-pass membrane protein; homodimer
Mol. Mass.:60474.00
Organism:Rattus norvegicus (rat)
Description:P97612 (aa 30-579)
Residue:550
BDBM50377670
NameBDBM50377670
Synonyms:CHEMBL254788
TypeSmall organic molecule
Emp. Form.C18H19N5O
Mol. Mass.321.3764
SMILESCN(C)C(=O)Cn1nnc(Cc2ccc(cc2)-c2ccccc2)n1