Reaction Details
TargetCannabinoid receptor 2
LigandBDBM50377671
Substrate/Competitorn/a
Meas. Tech.ChEMBL_479897 (CHEMBL935750)
Ki>10000±n/a nM
Citation Ortar, GSchiano Moriello, ACascio, MGDe Petrocellis, LLigresti, AMorera, ENalli, MDi Marzo, V New tetrazole-based selective anandamide uptake inhibitors. Bioorg Med Chem Lett18:2820-4 (2008) 
 
Cannabinoid receptor 2
Name:Cannabinoid receptor 2
Type:G Protein-Coupled Receptor (GPCR)
Mol. Mass.:39690.94
Organism:Homo sapiens (Human)
Description:P34972
Residue:360
BDBM50377671
NameBDBM50377671
Synonyms:CHEMBL403221
TypeSmall organic molecule
Emp. Form.C18H17N5O2
Mol. Mass.335.3599
SMILESCC(=O)Cn1nnnc1CNC(=O)c1ccc(cc1)-c1ccccc1