Reaction Details
TargetTransient receptor potential cation channel subfamily V member 1
LigandBDBM50377662
Substrate/Competitorn/a
Meas. Tech.ChEMBL_479900 (CHEMBL935753)
EC50>100000±n/a nM
Citation Ortar, GSchiano Moriello, ACascio, MGDe Petrocellis, LLigresti, AMorera, ENalli, MDi Marzo, V New tetrazole-based selective anandamide uptake inhibitors. Bioorg Med Chem Lett18:2820-4 (2008) 
 
Transient receptor potential cation channel subfamily V member 1
Name:Transient receptor potential cation channel subfamily V member 1
Type:Protein
Mol. Mass.:94960.75
Organism:Homo sapiens (Human)
Description:Q8NER1
Residue:839
BDBM50377662
NameBDBM50377662
Synonyms:CHEMBL404541
TypeSmall organic molecule
Emp. Form.C17H16N4O
Mol. Mass.292.3351
SMILESCC(=O)Cn1nnnc1Cc1ccc(cc1)-c1ccccc1