Reaction Details
TargetTransient receptor potential cation channel subfamily A member 1
LigandBDBM50377668
Substrate/Competitorn/a
Meas. Tech.ChEMBL_479898 (CHEMBL935751)
EC50>100000±n/a nM
Citation Ortar, GSchiano Moriello, ACascio, MGDe Petrocellis, LLigresti, AMorera, ENalli, MDi Marzo, V New tetrazole-based selective anandamide uptake inhibitors. Bioorg Med Chem Lett18:2820-4 (2008) 
 
Transient receptor potential cation channel subfamily A member 1
Name:Transient receptor potential cation channel subfamily A member 1
Type:PROTEIN
Mol. Mass.:128622.74
Organism:Rattus norvegicus
Description:ChEMBL_1450487
Residue:1125
BDBM50377668
NameBDBM50377668
Synonyms:CHEMBL258162
TypeSmall organic molecule
Emp. Form.C19H20N6O2
Mol. Mass.364.4011
SMILESCN(C)C(=O)Cn1nnc(CNC(=O)c2ccc(cc2)-c2ccccc2)n1