Reaction Details
TargetHistone deacetylase 6
LigandBDBM50354086
Substrate/Competitorn/a
Meas. Tech.ChEMBL_479926 (CHEMBL929249)
IC50 1595±n/a nM
Citation Mazitschek, RPatel, VWirth, DFClardy, J Development of a fluorescence polarization based assay for histone deacetylase ligand discovery. Bioorg Med Chem Lett18:2809-12 (2008) 
 
Histone deacetylase 6
Name:Histone deacetylase 6
Type:Chromatin regulator; hydrolase; repressor
Mol. Mass.:131381.51
Organism:Homo sapiens (Human)
Description:Q9UBN7
Residue:1215
BDBM50354086
NameBDBM50354086
Synonyms:FK-228 ROMIDEPSIN
TypeSmall organic molecule
Emp. Form.C25H39N3O6S2
Mol. Mass.541.724
SMILESC\C=C1/NC(=O)[C@@H](CS)NC(=O)[C@H](CC(=O)C[C@H](OC(=O)[C@@H](NC1=O)C(C)C)\C=C\CCS)C(C)C