Reaction Details
Target11-beta-hydroxysteroid dehydrogenase 1
LigandBDBM50377736
Substrate/Competitorn/a
Meas. Tech.ChEMBL_479968 (CHEMBL932361)
IC50 0.98±n/a nM
Citation Aster, SDGraham, DWKharbanda, DPatel, GPonpipom, MSantorelli, GMSzymonifka, MJMundt, SSShah, KSpringer, MSThieringer, RHermanowski-Vosatka, AWright, SDXiao, JZokian, HBalkovec, JM Bis-aryl triazoles as selective inhibitors of 11beta-hydroxysteroid dehydrogenase type 1. Bioorg Med Chem Lett18:2799-804 (2008) 
 
11-beta-hydroxysteroid dehydrogenase 1
Name:11-beta-hydroxysteroid dehydrogenase 1
Type:Enzyme
Mol. Mass.:32409.16
Organism:Homo sapiens (Human)
Description:P28845
Residue:292
BDBM50377736
NameBDBM50377736
Synonyms:CHEMBL403898
TypeSmall organic molecule
Emp. Form.C18H15ClN4
Mol. Mass.322.792
SMILESCn1c(nnc1-c1cccc2n(C)ccc12)-c1ccccc1Cl