Reaction Details
TargetRAF proto-oncogene serine/threonine-protein kinase
LigandBDBM50377763
Substrate/Competitorn/a
Meas. Tech.ChEMBL_480033 (CHEMBL927975)
IC50 2±n/a nM
Citation Wolin, RLBembenek, SDWei, JCrawford, SLundeen, KBrunmark, AKarlsson, LEdwards, JPBlevitt, JM Dual binding site inhibitors of B-RAF kinase. Bioorg Med Chem Lett18:2825-9 (2008) 
 
RAF proto-oncogene serine/threonine-protein kinase
Name:RAF proto-oncogene serine/threonine-protein kinase
Type:Serine/threonine-protein kinase
Mol. Mass.:73082.52
Organism:Homo sapiens (Human)
Description:P04049
Residue:648
BDBM50377763
NameBDBM50377763
Synonyms:CHEMBL258454
TypeSmall organic molecule
Emp. Form.C23H18ClF3N6O
Mol. Mass.486.877
SMILESCNc1nccc(n1)-c1nc([nH]c1-c1cccc(NC(=O)Cc2ccc(Cl)cc2)c1)C(F)(F)F