Reaction Details
TargetSerine/threonine-protein kinase B-raf
LigandBDBM50377765
Substrate/Competitorn/a
Meas. Tech.ChEMBL_480031 (CHEMBL927972)
IC50 4±n/a nM
Citation Wolin, RLBembenek, SDWei, JCrawford, SLundeen, KBrunmark, AKarlsson, LEdwards, JPBlevitt, JM Dual binding site inhibitors of B-RAF kinase. Bioorg Med Chem Lett18:2825-9 (2008) 
 
Serine/threonine-protein kinase B-raf
Name:Serine/threonine-protein kinase B-raf
Type:Serine/threonine-protein kinase
Mol. Mass.:84446.00
Organism:Homo sapiens (Human)
Description:P15056
Residue:766
BDBM50377765
NameBDBM50377765
Synonyms:CHEMBL254966
TypeSmall organic molecule
Emp. Form.C31H26ClN7O2
Mol. Mass.564.037
SMILESNC(=O)c1cccc(Nc2nccc(n2)-c2nc([nH]c2-c2cccc(NC(=O)Cc3ccc(Cl)cc3)c2)C2CC2)c1