Reaction Details
TargetBeta-secretase 1
LigandBDBM50377859
Substrate/Competitorn/a
Meas. Tech.ChEMBL_480070 (CHEMBL929346)
IC50 150±n/a nM
Citation Park, HMin, KKwak, HSKoo, KDLim, DSeo, SWChoi, JUPlatt, BChoi, DY Synthesis, SAR, and X-ray structure of human BACE-1 inhibitors with cyclic urea derivatives. Bioorg Med Chem Lett18:2900-4 (2008) 
 
Beta-secretase 1
Name:Beta-secretase 1
Type:Protein
Mol. Mass.:55755.10
Organism:Homo sapiens (Human)
Description:P56817
Residue:501
BDBM50377859
NameBDBM50377859
Synonyms:CHEMBL260621
TypeSmall organic molecule
Emp. Form.C32H36F4N4O3
Mol. Mass.600.6469
SMILESCC(C)(C)c1cccc(CNC[C@@H](O)[C@H](Cc2cc(F)cc(F)c2)NC(=O)[C@@H]2CN(Cc3cc(F)cc(F)c3)C(=O)N2)c1