Reaction Details
TargetCathepsin D
LigandBDBM50377859
Substrate/Competitorn/a
Meas. Tech.ChEMBL_480069 (CHEMBL929345)
Ki 66±n/a nM
Citation Park, HMin, KKwak, HSKoo, KDLim, DSeo, SWChoi, JUPlatt, BChoi, DY Synthesis, SAR, and X-ray structure of human BACE-1 inhibitors with cyclic urea derivatives. Bioorg Med Chem Lett18:2900-4 (2008) 
 
Cathepsin D
Name:Cathepsin D
Type:Enzyme
Mol. Mass.:44551.72
Organism:Homo sapiens (Human)
Description:Human proCathepsin D (SwissProt accession number P07339) was expressed in Sf9 cells, purified, and autoactivated.
Residue:412
BDBM50377859
NameBDBM50377859
Synonyms:CHEMBL260621
TypeSmall organic molecule
Emp. Form.C32H36F4N4O3
Mol. Mass.600.6469
SMILESCC(C)(C)c1cccc(CNC[C@@H](O)[C@H](Cc2cc(F)cc(F)c2)NC(=O)[C@@H]2CN(Cc3cc(F)cc(F)c3)C(=O)N2)c1