Reaction Details
TargetProstaglandin G/H synthase 1
LigandBDBM50135167
Substrate/Competitorn/a
Meas. Tech.ChEMBL_481473 (CHEMBL995706)
Kd 25100±n/a nM
Citation Szewczuk, LMPenning, TM Mechanism-based inactivation of COX-1 by red wine m-hydroquinones: a structure-activity relationship study. J Nat Prod67:1777-82 (2004) 
 
Prostaglandin G/H synthase 1
Name:Prostaglandin G/H synthase 1
Type:Protein
Mol. Mass.:68868.60
Organism:Ovis aries (Sheep)
Description:n/a
Residue:600
BDBM50135167
NameBDBM50135167
Synonyms:(+)-epicatechin (2S,3S)-2-(3,4-Dihydroxy-phenyl)-chroman-3,5,7-triol Epicatechin
TypeSmall organic molecule
Emp. Form.C15H14O6
Mol. Mass.290.2681
SMILESO[C@H]1Cc2c(O)cc(O)cc2O[C@H]1c1ccc(O)c(O)c1