Reaction Details
TargetFibroblast growth factor receptor 1
LigandBDBM50242740
Substrate/Competitorn/a
Meas. Tech.ChEMBL_531116 (CHEMBL973091)
EC50 80±n/a nM
Citation McDermott, USharma, SVDowell, LGreninger, PMontagut, CLamb, JArchibald, HRaudales, RTam, ALee, DRothenberg, SMSupko, JGSordella, RUlkus, LEIafrate, AJMaheswaran, SNjauw, CNTsao, HDrew, LHanke, JHMa, XJErlander, MGGray, NSHaber, DASettleman, J Identification of genotype-correlated sensitivity to selective kinase inhibitors by using high-throughput tumor cell line profiling. Proc Natl Acad Sci U S A104:19936-41 (2007) 
 
Fibroblast growth factor receptor 1
Name:Fibroblast growth factor receptor 1
Type:Receptor
Mol. Mass.:91861.70
Organism:Homo sapiens (Human)
Description:P11362
Residue:822
BDBM50242740
NameBDBM50242740
Synonyms:CHEMBL459850 Type II inhibitor, 14
TypeSmall organic molecule
Emp. Form.C22H19F3N6O2
Mol. Mass.456.4205
SMILESCN1C(=O)N(Cc2cnc(N)nc12)c1cc(NC(=O)c2cccc(c2)C(F)(F)F)ccc1C