Reaction Details
TargetDeath-associated protein kinase 3
LigandBDBM4814
Substrate/Competitorn/a
Meas. Tech.ChEMBL_531331 (CHEMBL990520)
Kd 300±n/a nM
Citation McDermott, USharma, SVDowell, LGreninger, PMontagut, CLamb, JArchibald, HRaudales, RTam, ALee, DRothenberg, SMSupko, JGSordella, RUlkus, LEIafrate, AJMaheswaran, SNjauw, CNTsao, HDrew, LHanke, JHMa, XJErlander, MGGray, NSHaber, DASettleman, J Identification of genotype-correlated sensitivity to selective kinase inhibitors by using high-throughput tumor cell line profiling. Proc Natl Acad Sci U S A104:19936-41 (2007) 
 
Death-associated protein kinase 3
Name:Death-associated protein kinase 3
Type:PROTEIN
Mol. Mass.:52537.07
Organism:Homo sapiens (Human)
Description:ChEMBL_586564
Residue:454
BDBM4814
NameBDBM4814
Synonyms:CHEMBL535 N-[2-(diethylamino)ethyl]-5-{[(3Z)-5-fluoro-2-oxo-2,3-dihydro-1H-indol-3-ylidene]methyl}-2,4-dimethyl-1H-pyrrole-3-carboxamide SUNITINIB US10464902, Sunitinib US9163010, Sunitinib | US9914707, SU11248
TypeSmall organic molecule
Emp. Form.C22H27FN4O2
Mol. Mass.398.4738
SMILESCCN(CC)CCNC(=O)c1c(C)[nH]c(\C=C2/C(=O)Nc3ccc(F)cc23)c1C